AnsweredAssumed Answered

Jive 8 local setup windows issues

Question asked by karthikodc on Apr 8, 2015
Latest reply on Oct 8, 2015 by pldorrell

Hi,

I tried to install Jive 8 on my local windows machine.

when I run this command mvn clean install -Djive.setup=false. I'm getting this error. can you please help me to fix this issue

 

INFO] Compiling 1 source file to C:\Code\HUB8\web\target\classes

[INFO] ------------------------------------------------------------------------

[INFO] Reactor Summary:

[INFO]

[INFO] HUB8 ............................................... SUCCESS [  2.870 s]

[INFO] weboverlay ......................................... FAILURE [  5.626 s]

[INFO] themes ............................................. SKIPPED

[INFO] ------------------------------------------------------------------------

[INFO] BUILD FAILURE

[INFO] ------------------------------------------------------------------------

[INFO] Total time: 8.982 s

[INFO] Finished at: 2015-04-09T10:56:05+10:00

[INFO] Final Memory: 24M/324M

[INFO] ------------------------------------------------------------------------

[ERROR] Failed to execute goal org.apache.maven.plugins:maven-compiler-plugin:3.1:compile (default-compile) on project web: Fatal error compiling: invalid target release: 1.8 -> [Help 1]

org.apache.maven.lifecycle.LifecycleExecutionException: Failed to execute goal org.apache.maven.plugins:maven-compiler-plugin:3.1:compile (default-compile) on project web: Fatal error compiling

  at org.apache.maven.lifecycle.internal.MojoExecutor.execute(MojoExecutor.java:216)

  at org.apache.maven.lifecycle.internal.MojoExecutor.execute(MojoExecutor.java:153)

  at org.apache.maven.lifecycle.internal.MojoExecutor.execute(MojoExecutor.java:145)

  at org.apache.maven.lifecycle.internal.LifecycleModuleBuilder.buildProject(LifecycleModuleBuilder.java:116)

  at org.apache.maven.lifecycle.internal.LifecycleModuleBuilder.buildProject(LifecycleModuleBuilder.java:80)

  at org.apache.maven.lifecycle.internal.builder.singlethreaded.SingleThreadedBuilder.build(SingleThreadedBuilder.java:51)

  at org.apache.maven.lifecycle.internal.LifecycleStarter.execute(LifecycleStarter.java:128)

  at org.apache.maven.DefaultMaven.doExecute(DefaultMaven.java:307)

  at org.apache.maven.DefaultMaven.doExecute(DefaultMaven.java:193)

  at org.apache.maven.DefaultMaven.execute(DefaultMaven.java:106)

  at org.apache.maven.cli.MavenCli.execute(MavenCli.java:862)

  at org.apache.maven.cli.MavenCli.doMain(MavenCli.java:286)

  at org.apache.maven.cli.MavenCli.main(MavenCli.java:197)

  at sun.reflect.NativeMethodAccessorImpl.invoke0(Native Method)

  at sun.reflect.NativeMethodAccessorImpl.invoke(NativeMethodAccessorImpl.java:57)

  at sun.reflect.DelegatingMethodAccessorImpl.invoke(DelegatingMethodAccessorImpl.java:43)

  at java.lang.reflect.Method.invoke(Method.java:606)

  at org.codehaus.plexus.classworlds.launcher.Launcher.launchEnhanced(Launcher.java:289)

  at org.codehaus.plexus.classworlds.launcher.Launcher.launch(Launcher.java:229)

  at org.codehaus.plexus.classworlds.launcher.Launcher.mainWithExitCode(Launcher.java:415)

  at org.codehaus.plexus.classworlds.launcher.Launcher.main(Launcher.java:356)

Caused by: org.apache.maven.plugin.MojoExecutionException: Fatal error compiling

  at org.apache.maven.plugin.compiler.AbstractCompilerMojo.execute(AbstractCompilerMojo.java:796)

  at org.apache.maven.plugin.compiler.CompilerMojo.execute(CompilerMojo.java:129)

  at org.apache.maven.plugin.DefaultBuildPluginManager.executeMojo(DefaultBuildPluginManager.java:134)

  at org.apache.maven.lifecycle.internal.MojoExecutor.execute(MojoExecutor.java:208)

  ... 20 more

Caused by: org.codehaus.plexus.compiler.CompilerException: invalid target release: 1.8

  at org.codehaus.plexus.compiler.javac.JavaxToolsCompiler.compileInProcess(JavaxToolsCompiler.java:191)

  at org.codehaus.plexus.compiler.javac.JavacCompiler.performCompile(JavacCompiler.java:169)

  at org.apache.maven.plugin.compiler.AbstractCompilerMojo.execute(AbstractCompilerMojo.java:785)

  ... 23 more

Caused by: java.lang.IllegalArgumentException: invalid target release: 1.8

  at com.sun.tools.javac.main.RecognizedOptions$GrumpyHelper.error(RecognizedOptions.java:88)

  at com.sun.tools.javac.main.RecognizedOptions$10.process(RecognizedOptions.java:359)

  at com.sun.tools.javac.api.JavacTool.processOptions(JavacTool.java:242)

  at com.sun.tools.javac.api.JavacTool.getTask(JavacTool.java:199)

  at com.sun.tools.javac.api.JavacTool.getTask(JavacTool.java:68)

  at org.codehaus.plexus.compiler.javac.JavaxToolsCompiler.compileInProcess(JavaxToolsCompiler.java:115)

  ... 25 more

 

cc benjamin.walker, Ryan King , Ryan Rutan

Outcomes