AnsweredAssumed Answered

Unable to build new Custom Project for Jive 8

Question asked by jliano on Mar 31, 2015
Latest reply on Apr 1, 2015 by jliano

I'm getting the following error when attempting to build a new Jive 8 Custom Project with the Maven plugin.

 

Has anyone been able to build this project?

localhost:jcs-demo-8.0.0.0 jorgeliano$ mvn clean install -Djive.setup=false -P jive

[INFO] Scanning for projects...

[INFO] ------------------------------------------------------------------------

[INFO] Reactor Build Order:

[INFO]

[INFO] jcs-demo-8.0.0.0

[INFO] weboverlay

[INFO] themes

[INFO]                                                                        

[INFO] ------------------------------------------------------------------------

[INFO] Building jcs-demo-8.0.0.0 8.0.0.0-0-SNAPSHOT

[INFO] ------------------------------------------------------------------------

[INFO]

[INFO] --- maven-clean-plugin:2.5:clean (default-clean) @ jcs-demo-8.0.0.0 ---

[INFO] Deleting /Users/jorgeliano/Development/jcs/jive-8.0.0.0/jcs-demo-8.0.0.0/target

[INFO]

[INFO] --- jive-parent-pom-version-check-plugin:1.5:check-parent-pom-version (check-parent-pom-version) @ jcs-demo-8.0.0.0 ---

[INFO] ************************************************************************************************************************************************

[INFO] Checking for newer versions of jive-parent-pom...

[INFO] You are currently using version 8.0.0.0-0 of jive-parent-pom.

[INFO] The latest version of jive-parent-pom is 8.0.0.0-0

[INFO] You are using the latest version.

[INFO] ************************************************************************************************************************************************

[INFO]

[INFO] --- maven-antrun-plugin:1.7:run (assemble-jive-artifacts) @ jcs-demo-8.0.0.0 ---

[INFO] Skipping Antrun execution

[INFO]

[INFO] --- maven-antrun-plugin:1.7:run (setup-jive-home) @ jcs-demo-8.0.0.0 ---

[INFO] Executing tasks

 

main:

     [echo] building jive home

    [mkdir] Created dir: /Users/jorgeliano/Development/jcs/jive-8.0.0.0/jcs-demo-8.0.0.0/target/jiveHome

    [mkdir] Created dir: /Users/jorgeliano/Development/jcs/jive-8.0.0.0/jcs-demo-8.0.0.0/target/jiveHome/plugins

    [mkdir] Created dir: /Users/jorgeliano/Development/jcs/jive-8.0.0.0/jcs-demo-8.0.0.0/target/jiveHome/themes

     [copy] Copying 2 files to /Users/jorgeliano/Development/jcs/jive-8.0.0.0/jcs-demo-8.0.0.0/target/jiveHome

[INFO] Executed tasks

[INFO]

[INFO] --- maven-antrun-plugin:1.7:run (explode-jive-plugin) @ jcs-demo-8.0.0.0 ---

[INFO] Skipping Antrun execution

[INFO]

[INFO] --- maven-antrun-plugin:1.7:run (repackage-jive-jar) @ jcs-demo-8.0.0.0 ---

[INFO] Skipping Antrun execution

[INFO]

[INFO] --- maven-install-plugin:2.4:install (default-install) @ jcs-demo-8.0.0.0 ---

[INFO] Installing /Users/jorgeliano/Development/jcs/jive-8.0.0.0/jcs-demo-8.0.0.0/pom.xml to /Users/jorgeliano/.m2/repository/com/jivesoftware/jcs/demo/jcs-demo-8.0.0.0/8.0.0.0-0-SNAPSHOT/jcs-demo-8.0.0.0-8.0.0.0-0-SNAPSHOT.pom

[INFO]                                                                        

[INFO] ------------------------------------------------------------------------

[INFO] Building weboverlay 8.0.0.0-0-SNAPSHOT

[INFO] ------------------------------------------------------------------------

[WARNING] The POM for com.jivesoftware:jive-war:war:8.0.0.0_1464_6ae55da is missing, no dependency information available

[WARNING] The POM for com.jivesoftware:jive-core:jar:8.0.0.0_1464_6ae55da is missing, no dependency information available

[INFO] ------------------------------------------------------------------------

[INFO] Reactor Summary:

[INFO]

[INFO] jcs-demo-8.0.0.0 ................................... SUCCESS [  2.039 s]

[INFO] weboverlay ......................................... FAILURE [  0.135 s]

[INFO] themes ............................................. SKIPPED

[INFO] ------------------------------------------------------------------------

[INFO] BUILD FAILURE

[INFO] ------------------------------------------------------------------------

[INFO] Total time: 2.510 s

[INFO] Finished at: 2015-03-31T07:56:54-07:00

[INFO] Final Memory: 15M/491M

[INFO] ------------------------------------------------------------------------

[ERROR] Failed to execute goal on project web: Could not resolve dependencies for project com.jivesoftware.jcs.demo:web:war:8.0.0.0-0-SNAPSHOT: The following artifacts could not be resolved: com.jivesoftware:jive-war:war:8.0.0.0_1464_6ae55da, com.jivesoftware:jive-core:jar:8.0.0.0_1464_6ae55da: Failure to find com.jivesoftware:jive-war:war:8.0.0.0_1464_6ae55da in https://maven-secure.jivesoftware.com/archiva/repository/jive.internal was cached in the local repository, resolution will not be reattempted until the update interval of jive.internal has elapsed or updates are forced -> [Help 1]

[ERROR]

[ERROR] To see the full stack trace of the errors, re-run Maven with the -e switch.

[ERROR] Re-run Maven using the -X switch to enable full debug logging.

[ERROR]

[ERROR] For more information about the errors and possible solutions, please read the following articles:

[ERROR] [Help 1] http://cwiki.apache.org/confluence/display/MAVEN/DependencyResolutionException

[ERROR]

[ERROR] After correcting the problems, you can resume the build with the command

[ERROR]   mvn <goals> -rf :web

localhost:jcs-demo-8.0.0.0 jorgeliano$

Outcomes